BDBM50104487 CHEMBL430453::Phosphoric acid 2-chloro-phenyl ester 2-(2-{2-[2-(2-{1-[3-(3-methyl-indol-1-yl)-propyl]-1H-indol-3-yl}-acetylamino)-ethoxy]-ethoxy}-ethoxy)-ethyl ester; compound with triethyl-amine
SMILES Cc1cn(CCCn2cc(CC(=O)NCCOCCOCCOCCOP(O)(=O)Oc3ccccc3Cl)c3ccccc23)c2ccccc12
InChI Key InChIKey=ISUYGSZSGJHUHX-UHFFFAOYSA-N
Data  1 IC50
  Tab Delimited (TSV)   2D SDfile   Computed 3D by Vconf -m prep SDfile
Find this compound or compounds like it in BindingDB:
Activity Spreadsheet -- Enzyme Inhibition Constant Data from BindingDB
Found 1 hit for monomerid = 50104487
TargetTelomerase reverse transcriptase(Homo sapiens (Human))
Kyushu University
Curated by ChEMBL
LigandPNGBDBM50104487(CHEMBL430453 | Phosphoric acid 2-chloro-phenyl est...)
Affinity DataIC50: >1.00E+5nM. Assay description: Inhibitory activity against telomerase extracted from HCT 116 cell lines
In DepthDetails ArticlePubMed