BDBM50104676 (4-Hexadecanoyl-3-hydroxy-5-oxo-2,5-dihydro-furan-2-yl)-acetic acid nonyl ester::CHEMBL323966
SMILES CCCCCCCCCCCCCCCC(=O)c1c(O)oc(CC(=O)OCCCCCCCCC)c1O
InChI Key InChIKey=MMUSQBDBCHNSAZ-UHFFFAOYSA-N
Data  2 IC50
  Tab Delimited (TSV)   2D SDfile   Computed 3D by Vconf -m prep SDfile
Find this compound or compounds like it in BindingDB:
Activity Spreadsheet -- Enzyme Inhibition Constant Data from BindingDB
Found 2 hits for monomerid = 50104676
TargetDual specificity protein phosphatase 3(Homo sapiens (Human))
Tohoku University
Curated by ChEMBL
LigandPNGBDBM50104676((4-Hexadecanoyl-3-hydroxy-5-oxo-2,5-dihydro-furan-...)
Affinity DataIC50:  3.79E+4nM. Assay description: Inhibitory activity against vaccinia VH1-related phosphatase(VHR)
In DepthDetails ArticlePubMed
TargetM-phase inducer phosphatase 2(Mus musculus)
Tohoku University
Curated by ChEMBL
LigandPNGBDBM50104676((4-Hexadecanoyl-3-hydroxy-5-oxo-2,5-dihydro-furan-...)
Affinity DataIC50:  1.20E+3nM. Assay description: Inhibitory activity against cell division cycle 25B
In DepthDetails ArticlePubMed