BDBM50104702 4-Hydroxy-5-hydroxymethyl-2-oxo-2,5-dihydro-furan-3-carboxylic acid 16-allyloxycarbonylamino-hexadecyl ester::CHEMBL110983
SMILES OCc1oc(O)c(C(=O)OCCCCCCCCCCCCCCCCNC(=O)OCC=C)c1O
InChI Key InChIKey=IIPADWVWRZBWKO-UHFFFAOYSA-N
Data  2 IC50
  Tab Delimited (TSV)   2D SDfile   Computed 3D by Vconf -m prep SDfile
Find this compound or compounds like it in BindingDB:
Activity Spreadsheet -- Enzyme Inhibition Constant Data from BindingDB
Found 2 hits for monomerid = 50104702
TargetM-phase inducer phosphatase 2(Mus musculus)
Tohoku University
Curated by ChEMBL
LigandPNGBDBM50104702(4-Hydroxy-5-hydroxymethyl-2-oxo-2,5-dihydro-furan-...)
Affinity DataIC50:  2.29E+4nM. Assay description: Inhibitory activity against cell division cycle 25B
In DepthDetails ArticlePubMed
TargetDual specificity protein phosphatase 3(Homo sapiens (Human))
Tohoku University
Curated by ChEMBL
LigandPNGBDBM50104702(4-Hydroxy-5-hydroxymethyl-2-oxo-2,5-dihydro-furan-...)
Affinity DataIC50: >2.50E+5nM. Assay description: Inhibitory activity against vaccinia VH1-related phosphatase(VHR)
In DepthDetails ArticlePubMed