BDBM50105144 CHEMBL543884::N1,N9-Di(3-(di((4,6-diamino-1,3,5-triazin-2-yl)methyl)amino)propyl)-1,9nonanediamine Heptachloride
SMILES Nc1nc(N)nc(CN(CCCNCCCCCCCCCNCCCN(Cc2nc(N)nc(N)n2)Cc2nc(N)nc(N)n2)Cc2nc(N)nc(N)n2)n1
InChI Key InChIKey=AEKPXOHWOUMIOZ-UHFFFAOYSA-N
Data  1 KI
  Tab Delimited (TSV)   2D SDfile   Computed 3D by Vconf -m prep SDfile
Find this compound or compounds like it in BindingDB:
Activity Spreadsheet -- Enzyme Inhibition Constant Data from BindingDB
Found 1 hit for monomerid = 50105144
TargetAdenosine transporter 1(Trypanosoma brucei)
Cardiff University
Curated by ChEMBL
LigandPNGBDBM50105144(CHEMBL543884 | N1,N9-Di(3-(di((4,6-diamino-1,3,5-t...)
Affinity DataKi:  8.20E+4nM. Assay description: Ability to inhibit adenosine uptake by the P2 transporter in Trypanosoma brucei
In DepthDetails ArticlePubMed