BDBM50105281 2-[4-(4-Chloro-benzyl)-7-ethyl-naphthalen-1-yl]-propionic acid::CHEMBL90660
SMILES CCc1ccc2c(Cc3ccc(Cl)cc3)ccc(C(C)C(O)=O)c2c1
InChI Key InChIKey=JYYLWANQIKFDGF-UHFFFAOYSA-N
Data  2 IC50
  Tab Delimited (TSV)   2D SDfile   Computed 3D by Vconf -m prep SDfile
Find this compound or compounds like it in BindingDB:
Activity Spreadsheet -- Enzyme Inhibition Constant Data from BindingDB
Found 2 hits for monomerid = 50105281
TargetProstaglandin G/H synthase 1(RAT)
RhôNe-Poulenc Rorer
Curated by ChEMBL
LigandPNGBDBM50105281(2-[4-(4-Chloro-benzyl)-7-ethyl-naphthalen-1-yl]-pr...)
Affinity DataIC50:  6.10E+4nM. Assay description: In vitro inhibitory concentration against rat prostaglandin G/H synthase 1
In DepthDetails ArticlePubMed
TargetProstaglandin G/H synthase 2(RAT)
RhôNe-Poulenc Rorer
Curated by ChEMBL
LigandPNGBDBM50105281(2-[4-(4-Chloro-benzyl)-7-ethyl-naphthalen-1-yl]-pr...)
Affinity DataIC50:  8.20E+3nM. Assay description: In vitro inhibitory concentration against rat Prostaglandin G/H synthase 2
In DepthDetails ArticlePubMed