BDBM50105306 CHEMBL3597782
SMILES Fc1ccc(Br)c(F)c1[C@H]1C[C@H](Nc2nnnn12)c1cccc(Br)c1
InChI Key InChIKey=ZPGJYNVLLYBBAD-QWHCGFSZSA-N
Data  2 IC50  1 Kd
  Tab Delimited (TSV)   2D SDfile   Computed 3D by Vconf -m prep SDfile
Find this compound or compounds like it in BindingDB:
Activity Spreadsheet -- Enzyme Inhibition Constant Data from BindingDB
Found 3 hits for monomerid = 50105306
TargetEndothelial PAS domain-containing protein 1(Homo sapiens (Human))
University Of Texas Southwestern Medical Center
Curated by ChEMBL
LigandPNGBDBM50105306(CHEMBL3597782)
Affinity DataKd:  34nM. Assay description: Binding affinity to wild type His6-Gbeta1-fused HIF-2alpha PAS-B domain (240 to 350) (unknown origin) expressed in Escherichia coli by ITC analysis
In DepthDetails ArticlePubMed
TargetEndothelial PAS domain-containing protein 1/Hypoxia-inducible factor 1-alpha(Homo sapiens (Human))
University Of Texas Southwestern Medical Center
Curated by ChEMBL
LigandPNGBDBM50105306(CHEMBL3597782)
Affinity DataIC50:  3.80E+6nM. Assay description: Binding affinity to wild type GST-tagged HIF-2alpha PAS-B S304M mutant (240 to 350) (unknown origin) expressed in Escherichia coli assessed as inhibi...
In DepthDetails ArticlePubMed
TargetEndothelial PAS domain-containing protein 1(Homo sapiens (Human))
University Of Texas Southwestern Medical Center
Curated by ChEMBL
LigandPNGBDBM50105306(CHEMBL3597782)
Affinity DataIC50:  32nM. Assay description: Binding affinity to wild type GST-tagged HIF-2alpha PAS-B (240 to 350) (unknown origin) expressed in Escherichia coli assessed as inhibition of inter...
In DepthDetails ArticlePubMed