BDBM50105316 CHEMBL3597670
SMILES Brc1cccc(c1)C1CC(c2ccccc2I)n2nnnc2N1
InChI Key InChIKey=IOJXHZLDNWOTBN-UHFFFAOYSA-N
Data  1 Kd
  Tab Delimited (TSV)   2D SDfile   Computed 3D by Vconf -m prep SDfile
Find this compound or compounds like it in BindingDB:
Activity Spreadsheet -- Enzyme Inhibition Constant Data from BindingDB
Found 1 hit for monomerid = 50105316
TargetEndothelial PAS domain-containing protein 1(Homo sapiens (Human))
University Of Texas Southwestern Medical Center
Curated by ChEMBL
LigandPNGBDBM50105316(CHEMBL3597670)
Affinity DataKd:  766nM. Assay description: Binding affinity to wild type His6-Gbeta1-fused HIF-2alpha PAS-B domain (240 to 350) (unknown origin) expressed in Escherichia coli by ITC analysis
In DepthDetails ArticlePubMed