BDBM50105460 2-Acetylamino-N-hydroxy-2-methyl-3-(4-phenoxy-benzenesulfonyl)-propionamide::CHEMBL92327
SMILES CC(=O)NC(C)(CS(=O)(=O)c1ccc(Oc2ccccc2)cc1)C(=O)NO
InChI Key InChIKey=TWTZRHWHKRIAHT-UHFFFAOYSA-N
Data  5 IC50
  Tab Delimited (TSV)   2D SDfile   Computed 3D by Vconf -m prep SDfile
Find this compound or compounds like it in BindingDB:
Activity Spreadsheet -- Enzyme Inhibition Constant Data from BindingDB
Found 5 hits for monomerid = 50105460
Target72 kDa type IV collagenase(Homo sapiens (Human))
Jadavpur University
Curated by ChEMBL
LigandPNGBDBM50105460(2-Acetylamino-N-hydroxy-2-methyl-3-(4-phenoxy-benz...)
Affinity DataIC50:  40nM. Assay description: Inhibition of human recombinant MMP2 by colorimetric analysis
In DepthDetails ArticlePubMed
Target72 kDa type IV collagenase(Homo sapiens (Human))
Jadavpur University
Curated by ChEMBL
LigandPNGBDBM50105460(2-Acetylamino-N-hydroxy-2-methyl-3-(4-phenoxy-benz...)
Affinity DataIC50:  40nM. Assay description: Inhibition of human recombinant MMP2 by colorimetric analysis
In DepthDetails ArticlePubMed
TargetCollagenase 3(Homo sapiens (Human))
Pfizer
Curated by ChEMBL
LigandPNGBDBM50105460(2-Acetylamino-N-hydroxy-2-methyl-3-(4-phenoxy-benz...)
Affinity DataIC50:  42nM. Assay description: Inhibitory activity against human Matrix metalloprotease-13
In DepthDetails ArticlePubMed
TargetInterstitial collagenase(Homo sapiens (Human))
Pfizer
Curated by ChEMBL
LigandPNGBDBM50105460(2-Acetylamino-N-hydroxy-2-methyl-3-(4-phenoxy-benz...)
Affinity DataIC50: >1.00E+4nM. Assay description: Inhibition of Matrix metalloprotease-1
In DepthDetails ArticlePubMed
Target72 kDa type IV collagenase(Homo sapiens (Human))
Jadavpur University
Curated by ChEMBL
LigandPNGBDBM50105460(2-Acetylamino-N-hydroxy-2-methyl-3-(4-phenoxy-benz...)
Affinity DataIC50:  40nM. Assay description: Inhibitory activity against human Matrix metalloprotease-2
In DepthDetails ArticlePubMed