BDBM50105480 CHEMBL98194
SMILES Cc1cnc(NCC(F)(F)c2ccccc2)c(=O)n1CC(=O)NCc1ccc2[nH]nc(N)c2c1
InChI Key InChIKey=METREVJJNAIYEN-MCOCGALXSA-N
Data  1 KI
  Tab Delimited (TSV)   2D SDfile   Computed 3D by Vconf -m prep SDfile
Find this compound or compounds like it in BindingDB:
Activity Spreadsheet -- Enzyme Inhibition Constant Data from BindingDB
Found 1 hit for monomerid = 50105480
TargetProthrombin(Homo sapiens (Human))
Corvas International
Curated by ChEMBL
LigandPNGBDBM50105480(CHEMBL98194)
Affinity DataKi:  4.10nM. Assay description: In vitro inhibitory activity against human Thrombin (FIIa) cleavage of the chromogenic substrate
In DepthDetails ArticlePubMed