BDBM50105584 3-Hydroxy-benzoic acid 5,7-dihydroxy-chroman-3-yl ester::CHEMBL92677
SMILES Oc1cccc(c1)C(=O)OC1COc2cc(O)cc(O)c2C1
InChI Key InChIKey=WSMRBGAHWJNHED-UHFFFAOYSA-N
Data  1 IC50
  Tab Delimited (TSV)   2D SDfile   Computed 3D by Vconf -m prep SDfile
Find this compound or compounds like it in BindingDB:
Activity Spreadsheet -- Enzyme Inhibition Constant Data from BindingDB
Found 1 hit for monomerid = 50105584
TargetReverse transcriptase/RNaseH(Human immunodeficiency virus 1)
University Of Toledo
Curated by ChEMBL
LigandPNGBDBM50105584(3-Hydroxy-benzoic acid 5,7-dihydroxy-chroman-3-yl ...)
Affinity DataIC50: >1.00E+5nM. Assay description: Inhibition of polymerization in wild type HIV-1 RT with poly rC/dG12-18 template primer and [3H]dGTP
In DepthDetails ArticlePubMed