BDBM50105765 4-[5-(2-Amino-pyrimidin-4-yl)-4-(4-fluoro-phenyl)-imidazol-1-yl]-cyclohexanol::CHEMBL319988
SMILES Nc1nccc(n1)-c1c(ncn1[C@H]1CC[C@H](O)CC1)-c1ccc(F)cc1
InChI Key InChIKey=YNEJNUAUXPCFAS-SHTZXODSSA-N
Data  1 IC50
PDB links: 1 PDB ID matches this monomer.
  Tab Delimited (TSV)   2D SDfile   Computed 3D by Vconf -m prep SDfile
Find this compound or compounds like it in BindingDB:
Activity Spreadsheet -- Enzyme Inhibition Constant Data from BindingDB
Found 1 hit for monomerid = 50105765
TargetMitogen-activated protein kinase 14(Homo sapiens (Human))
Glaxosmithkline
Curated by ChEMBL
LigandPNGBDBM50105765(4-[5-(2-Amino-pyrimidin-4-yl)-4-(4-fluoro-phenyl)-...)
Affinity DataIC50:  83nM. Assay description: Inhibition against Mitogen-activated protein kinase p38 alpha
In DepthDetails ArticlePubMed