BDBM50105818 4-Amino-N-methyl-N-(2-phenyl-2H-pyrazol-3-yl)-benzenesulfonamide::CHEMBL443542
SMILES CN(c1ccnn1-c1ccccc1)S(=O)(=O)c1ccc(N)cc1
InChI Key InChIKey=SVRQHLJTMFHCPE-UHFFFAOYSA-N
Data  4 IC50
  Tab Delimited (TSV)   2D SDfile   Computed 3D by Vconf -m prep SDfile
Find this compound or compounds like it in BindingDB:
Activity Spreadsheet -- Enzyme Inhibition Constant Data from BindingDB
Found 4 hits for monomerid = 50105818
TargetCytochrome P450 2C19(Homo sapiens (Human))
Université
Curated by ChEMBL
LigandPNGBDBM50105818(4-Amino-N-methyl-N-(2-phenyl-2H-pyrazol-3-yl)-benz...)
Affinity DataIC50:  2.00E+5nM. Assay description: Inhibitory effect on human recombinant liver cytochrome P450 2C19 expressed in yeast strain
In DepthDetails ArticlePubMed
TargetCytochrome P450 2C18(Homo sapiens (Human))
Université
Curated by ChEMBL
LigandPNGBDBM50105818(4-Amino-N-methyl-N-(2-phenyl-2H-pyrazol-3-yl)-benz...)
Affinity DataIC50:  1.50E+4nM. Assay description: Inhibitory effect on human recombinant liver cytochrome P450 2C18 expressed in yeast strain
In DepthDetails ArticlePubMed
TargetCytochrome P450 2C9(Homo sapiens (Human))
Université
Curated by ChEMBL
LigandPNGBDBM50105818(4-Amino-N-methyl-N-(2-phenyl-2H-pyrazol-3-yl)-benz...)
Affinity DataIC50:  1.00E+5nM. Assay description: Inhibitory effect on human recombinant liver cytochrome P450 2C9 expressed in yeast strain
In DepthDetails ArticlePubMed
TargetCytochrome P450 2C8(Homo sapiens (Human))
Université
Curated by ChEMBL
LigandPNGBDBM50105818(4-Amino-N-methyl-N-(2-phenyl-2H-pyrazol-3-yl)-benz...)
Affinity DataIC50:  5.00E+4nM. Assay description: Inhibitory effect on human recombinant liver Cytochrome P450 2C8 expressed in yeast strain
In DepthDetails ArticlePubMed