BDBM50105945 3-Hydroxy-4-[N'-(3-methyl-5-oxo-1-p-tolyl-1,5-dihydro-pyrazol-4-ylidene)-hydrazino]-naphthalene-1-sulfonic acid::CHEMBL333921
SMILES Cc1[nH]n(-c2ccc(C)cc2)c(=O)c1N=Nc1c(O)cc(c2ccccc12)S(O)(=O)=O
InChI Key InChIKey=KEYSQYAWKMFCON-UHFFFAOYSA-N
Data  1 EC50
  Tab Delimited (TSV)   2D SDfile   Computed 3D by Vconf -m prep SDfile
Find this compound or compounds like it in BindingDB:
Activity Spreadsheet -- Enzyme Inhibition Constant Data from BindingDB
Found 1 hit for monomerid = 50105945
TargetThrombopoietin receptor(Homo sapiens (Human))
Glaxosmithkline
Curated by ChEMBL
LigandPNGBDBM50105945(3-Hydroxy-4-[N'-(3-methyl-5-oxo-1-p-tolyl-1,5-dihy...)
Affinity DataEC50:  2.00E+3nM. Assay description: Effective concentration for thrombopoietin luciferase activity was determined in BAF-3 cells
In DepthDetails ArticlePubMed