BDBM50105962 3-Hydroxy-4-{N'-[1-(4-isopropyl-phenyl)-3-methyl-5-oxo-1,5-dihydro-pyrazol-4-ylidene]-hydrazino}-naphthalene-1-sulfonic acid::CHEMBL333209
SMILES CC(C)c1ccc(cc1)-n1[nH]c(C)c(N=Nc2c(O)cc(c3ccccc23)S(O)(=O)=O)c1=O
InChI Key InChIKey=WZFPTWOAAUNKPL-UHFFFAOYSA-N
Data  1 EC50
  Tab Delimited (TSV)   2D SDfile   Computed 3D by Vconf -m prep SDfile
Find this compound or compounds like it in BindingDB:
Activity Spreadsheet -- Enzyme Inhibition Constant Data from BindingDB
Found 1 hit for monomerid = 50105962
TargetThrombopoietin receptor(Homo sapiens (Human))
Glaxosmithkline
Curated by ChEMBL
LigandPNGBDBM50105962(3-Hydroxy-4-{N'-[1-(4-isopropyl-phenyl)-3-methyl-5...)
Affinity DataEC50:  70nM. Assay description: Effective concentration for thrombopoietin luciferase activity was determined in BAF-3 cells
In DepthDetails ArticlePubMed