BDBM50106001 CHEMBL3598068
SMILES [2H]C([2H])([2H])N(C(=O)c1c(F)cccc1Cl)c1ccc(cc1N1CC2CC2C1)-c1cc(NC(=O)OC(C)C)nn1C(C)C
InChI Key InChIKey=YQZGCJYFHDVINM-UHFFFAOYSA-N
Data  1 IC50  1 EC50
  Tab Delimited (TSV)   2D SDfile   Computed 3D by Vconf -m prep SDfile
Find this compound or compounds like it in BindingDB:
Activity Spreadsheet -- Enzyme Inhibition Constant Data from BindingDB
Found 2 hits for monomerid = 50106001
TargetNuclear receptor ROR-gamma(Homo sapiens (Human))
Biogen
Curated by ChEMBL
LigandPNGBDBM50106001(CHEMBL3598068)
Affinity DataEC50:  57nM. Assay description: Inverse agonist activity at RORgamma (unknown origin) transfected in HEK293T cells after 16 to 20 hrs by GAL4 luciferase reporter gene assay
In DepthDetails ArticlePubMed
TargetNuclear receptor ROR-gamma(Homo sapiens (Human))
Biogen
Curated by ChEMBL
LigandPNGBDBM50106001(CHEMBL3598068)
Affinity DataIC50:  21nM. Assay description: Binding affinity to GST-tagged RORgamma LBD (unknown origin) assessed as inhibition of interaction with co-activatior peptide TRAP220 preincubated fo...
In DepthDetails ArticlePubMed