BDBM50106209 CHEMBL3598102
SMILES CS(=O)(=O)c1cnc(O[C@H]2CC[C@@H](CC2)OC2CCN(CC2)C(=O)OC2CCOC2)cn1
InChI Key InChIKey=VIZJAUDSCRTGLT-IBOPQAGSSA-N
Data  2 EC50
  Tab Delimited (TSV)   2D SDfile   Computed 3D by Vconf -m prep SDfile
Find this compound or compounds like it in BindingDB:
Activity Spreadsheet -- Enzyme Inhibition Constant Data from BindingDB
Found 2 hits for monomerid = 50106209
TargetGlucose-dependent insulinotropic receptor(Rattus norvegicus)
Arena Pharmaceuticals
Curated by ChEMBL
LigandPNGBDBM50106209(CHEMBL3598102)
Affinity DataEC50:  1.50E+3nM. Assay description: Agonist activity at rat GPR119 by HTRF cAMP assay
In DepthDetails ArticlePubMed
TargetGlucose-dependent insulinotropic receptor(Homo sapiens (Human))
Arena Pharmaceuticals
Curated by ChEMBL
LigandPNGBDBM50106209(CHEMBL3598102)
Affinity DataEC50:  427nM. Assay description: Agonist activity at human GPR119 by HTRF cAMP assay
In DepthDetails ArticlePubMed