BDBM50106440 8-Bromo-1-(3,4-dihydroxy-benzoyl)-7-hydroxy-6-methoxy-isoquinoline-3-carboxylic acid::CHEMBL132276
SMILES COc1cc2cc(nc(C(=O)c3ccc(O)c(O)c3)c2c(Br)c1O)C(O)=O
InChI Key InChIKey=IJKZXTUQQILWMJ-UHFFFAOYSA-N
Data  1 KI
  Tab Delimited (TSV)   2D SDfile   Computed 3D by Vconf -m prep SDfile
Find this compound or compounds like it in BindingDB:
Activity Spreadsheet -- Enzyme Inhibition Constant Data from BindingDB
Found 1 hit for monomerid = 50106440
TargetInsulin-like growth factor-binding protein 3(Homo sapiens (Human))
Neurocrine Biosciences
Curated by ChEMBL
LigandPNGBDBM50106440(8-Bromo-1-(3,4-dihydroxy-benzoyl)-7-hydroxy-6-meth...)
Affinity DataKi:  140nM. Assay description: Inhibitory activity against Insulin-like growth factor binding protein 3
In DepthDetails ArticlePubMed