BDBM50106487 CHEMBL3600970
SMILES Clc1ccc(cc1)-c1ccc(CCCNc2ccc(CN3CCCCC3)cc2)cc1
InChI Key InChIKey=KFIBFLUHCJZUTE-UHFFFAOYSA-N
Data  3 IC50
  Tab Delimited (TSV)   2D SDfile   Computed 3D by Vconf -m prep SDfile
Find this compound or compounds like it in BindingDB:
Activity Spreadsheet -- Enzyme Inhibition Constant Data from BindingDB
Found 3 hits for monomerid = 50106487
Target5-hydroxytryptamine receptor 2A(Homo sapiens (Human))
Boehringer Ingelheim Pharma
Curated by ChEMBL
LigandPNGBDBM50106487(CHEMBL3600970)
Affinity DataIC50:  680nM. Assay description: Binding affinity to 5HT2A receptor (unknown origin)
In DepthDetails ArticlePubMed
TargetMelanin-concentrating hormone receptor 1(Homo sapiens (Human))
Boehringer Ingelheim Pharma
Curated by ChEMBL
LigandPNGBDBM50106487(CHEMBL3600970)
Affinity DataIC50:  3nM. Assay description: Displacement of [125I-MCH] from human MCH receptor 1 expressed in CHO cell membranes by scintillation counting method
In DepthDetails ArticlePubMed
TargetMuscarinic acetylcholine receptor M1(Homo sapiens (Human))
Boehringer Ingelheim Pharma
Curated by ChEMBL
LigandPNGBDBM50106487(CHEMBL3600970)
Affinity DataIC50:  325nM. Assay description: Binding affinity to muscarinic M1 receptor (unknown origin)
In DepthDetails ArticlePubMed