BDBM50106565 2-[(2-Fluoro-benzyl)-hydroxy-phosphinoylmethyl]-pentanedioic acid::CHEMBL335775
SMILES OC(=O)CCC(CP(O)(=O)Cc1ccccc1F)C(O)=O
InChI Key InChIKey=LGBHWCHYODMSKL-UHFFFAOYSA-N
Data  1 IC50
  Tab Delimited (TSV)   2D SDfile   Computed 3D by Vconf -m prep SDfile
Find this compound or compounds like it in BindingDB:
Activity Spreadsheet -- Enzyme Inhibition Constant Data from BindingDB
Found 1 hit for monomerid = 50106565
TargetGlutamate carboxypeptidase 2(Rattus norvegicus)
Guilford Pharmaceuticals
Curated by ChEMBL
LigandPNGBDBM50106565(2-[(2-Fluoro-benzyl)-hydroxy-phosphinoylmethyl]-pe...)
Affinity DataIC50:  156nM. Assay description: Inhibitory concentration against rat brain NAALADase (Folate hydrolase)
In DepthDetails ArticlePubMed