BDBM50106572 2-[Hydroxy-(4-methoxy-benzyl)-phosphinoylmethyl]-pentanedioic acid::CHEMBL134095
SMILES COc1ccc(CP(O)(=O)CC(CCC(O)=O)C(O)=O)cc1
InChI Key InChIKey=CHTREKLBQHLOFC-UHFFFAOYSA-N
Data  1 IC50
  Tab Delimited (TSV)   2D SDfile   Computed 3D by Vconf -m prep SDfile
Find this compound or compounds like it in BindingDB:
Activity Spreadsheet -- Enzyme Inhibition Constant Data from BindingDB
Found 1 hit for monomerid = 50106572
TargetGlutamate carboxypeptidase 2(Rattus norvegicus)
Guilford Pharmaceuticals
Curated by ChEMBL
LigandPNGBDBM50106572(2-[Hydroxy-(4-methoxy-benzyl)-phosphinoylmethyl]-p...)
Affinity DataIC50:  90nM. Assay description: Inhibitory concentration against rat brain NAALADase (Folate hydrolase)
In DepthDetails ArticlePubMed