BDBM50106826 CHEMBL104217::N-(5-{(R)-2-[(R)-1-(4-Cyano-phenyl)-2-phenyl-ethylamino]-1-hydroxy-ethyl}-2-hydroxy-phenyl)-methanesulfonamide
SMILES CS(=O)(=O)Nc1cc(ccc1O)[C@@H](O)CN[C@H](Cc1ccccc1)c1ccc(cc1)C#N
InChI Key InChIKey=HFITYLFCKGJHCX-QPPBQGQZSA-N
Data  1 KI
  Tab Delimited (TSV)   2D SDfile   Computed 3D by Vconf -m prep SDfile
Find this compound or compounds like it in BindingDB:
Activity Spreadsheet -- Enzyme Inhibition Constant Data from BindingDB
Found 1 hit for monomerid = 50106826
TargetBeta-3 adrenergic receptor(Homo sapiens (Human))
Bristol-Myers Squibb Pharmaceutical Research Institute
Curated by ChEMBL
LigandPNGBDBM50106826(CHEMBL104217 | N-(5-{(R)-2-[(R)-1-(4-Cyano-phenyl)...)
Affinity DataKi:  210nM. Assay description: Binding affinity to CHO cells expressing the cloned human beta-3 adrenergic receptor in the presence of [125I]-iodocyanopindolol
In DepthDetails ArticlePubMed