BDBM50107012 CHEMBL3600769
SMILES Cn1nccc1-c1ccc2nc(N)sc2c1
InChI Key InChIKey=XLHCOGAJPJDPML-UHFFFAOYSA-N
Data  7 IC50
  Tab Delimited (TSV)   2D SDfile   Computed 3D by Vconf -m prep SDfile
Find this compound or compounds like it in BindingDB:
Activity Spreadsheet -- Enzyme Inhibition Constant Data from BindingDB
Found 7 hits for monomerid = 50107012
LigandPNGBDBM50107012(CHEMBL3600769)
Affinity DataIC50:  2.51E+3nM. Assay description: Inhibition of PI3Kgamma (unknown origin) pre-incubated for 20 mins before phosphatidylinositol 4, 5-bisphosphate substrate addition by kinase-glo plu...
In DepthDetails ArticlePubMed
LigandPNGBDBM50107012(CHEMBL3600769)
Affinity DataIC50:  2.51E+4nM. Assay description: Inhibition of PI3Kdelta (unknown origin) pre-incubated for 20 mins before phosphatidylinositol 4, 5-bisphosphate substrate addition by kinase-glo plu...
In DepthDetails ArticlePubMed
TargetPhosphatidylinositol 4-phosphate 5-kinase type-1 gamma(Homo sapiens (Human))
Astrazeneca
Curated by ChEMBL
LigandPNGBDBM50107012(CHEMBL3600769)
Affinity DataIC50: <1.00E+5nM. Assay description: Inhibition of PIP5K1C (unknown origin) using D-myo-phosphatidylinositol 4-phosphate substrate and ATP by ADP-Glo kinase Assay
In DepthDetails ArticlePubMed
LigandPNGBDBM50107012(CHEMBL3600769)
Affinity DataIC50:  3.16E+4nM. Assay description: Inhibition of PI3Kbeta (unknown origin) pre-incubated for 20 mins before phosphatidylinositol 4, 5-bisphosphate substrate addition by kinase-glo plus...
In DepthDetails ArticlePubMed
TargetPhosphatidylinositol 4-kinase alpha(Homo sapiens (Human))
Astrazeneca
Curated by ChEMBL
LigandPNGBDBM50107012(CHEMBL3600769)
Affinity DataIC50:  1.26E+4nM. Assay description: Inhibition of N-terminal FLAG-tagged human full length recombinant PI4K3alpha using D-myo-phosphatidylinositol substrate and ATP incubated for 45 min...
In DepthDetails ArticlePubMed
LigandPNGBDBM50107012(CHEMBL3600769)
Affinity DataIC50:  1.26E+4nM. Assay description: Inhibition of PI3Kalpha (unknown origin) pre-incubated for 20 mins before phosphatidylinositol 4, 5-bisphosphate substrate addition by kinase-glo plu...
In DepthDetails ArticlePubMed
TargetPhosphatidylinositol 4-kinase beta(Homo sapiens (Human))
Astrazeneca
Curated by ChEMBL
LigandPNGBDBM50107012(CHEMBL3600769)
Affinity DataIC50:  1.00E+3nM. Assay description: Inhibition of N-terminal GST-tagged human full length recombinant PI4K3beta expressed in Sf9 cells using D-myo-phosphatidylinositol substrate and ATP...
In DepthDetails ArticlePubMed