BDBM50107030 CHEMBL106459::N-(2-Methyl-benzoyl)-N'-(4-phenyl-butyl)-guanidine
SMILES Cc1ccccc1C(=O)NC(N)=NCCCCc1ccccc1
InChI Key InChIKey=ARBHZAIGPOZDTK-UHFFFAOYSA-N
Data  2 IC50
  Tab Delimited (TSV)   2D SDfile   Computed 3D by Vconf -m prep SDfile
Find this compound or compounds like it in BindingDB:
Activity Spreadsheet -- Enzyme Inhibition Constant Data from BindingDB
Found 2 hits for monomerid = 50107030
TargetSodium channel protein type 5 subunit alpha(Homo sapiens (Human))
Cenes Pharmaceuticals
Curated by ChEMBL
LigandPNGBDBM50107030(CHEMBL106459 | N-(2-Methyl-benzoyl)-N'-(4-phenyl-b...)
Affinity DataIC50:  1.75E+3nM. Assay description: Inhibition of sodium channel blockade in CHO cells expressing human cardiac (hHI) sodium channel
In DepthDetails ArticlePubMed
TargetSodium channel protein type 2 subunit alpha(Homo sapiens (Human))
Cenes Pharmaceuticals
Curated by ChEMBL
LigandPNGBDBM50107030(CHEMBL106459 | N-(2-Methyl-benzoyl)-N'-(4-phenyl-b...)
Affinity DataIC50:  1.20E+3nM. Assay description: Inhibition of sodium channel blockade in CHO cells expressing neuronal mammalian type IIA (CNaIIA) sodium channel
In DepthDetails ArticlePubMed