BDBM50107312 CHEMBL3600995
SMILES OC(=O)CCc1ccc(OCc2coc(n2)-c2cccc(F)c2)cc1
InChI Key InChIKey=DAGIFGMPGCHTCL-UHFFFAOYSA-N
Data  1 EC50
  Tab Delimited (TSV)   2D SDfile   Computed 3D by Vconf -m prep SDfile
Find this compound or compounds like it in BindingDB:
Activity Spreadsheet -- Enzyme Inhibition Constant Data from BindingDB
Found 1 hit for monomerid = 50107312
TargetFree fatty acid receptor 1(Homo sapiens (Human))
Enamine
Curated by ChEMBL
LigandPNGBDBM50107312(CHEMBL3600995)
Affinity DataEC50:  560nM. Assay description: Agonist activity at GPR40 (unknown origin) expressed in CHO cells by FLIPR calcium flux assay in presence of 0.1% bovine serum albumin
In DepthDetails ArticlePubMed