BDBM50107677 (3-Hydroxy-phenyl)-(5-methoxy-1H-indol-2-yl)-methanone::CHEMBL140223
SMILES COc1ccc2[nH]c(cc2c1)C(=O)c1cccc(O)c1
InChI Key InChIKey=QRFPYHLUVHWYOI-UHFFFAOYSA-N
Data  1 IC50
  Tab Delimited (TSV)   2D SDfile   Computed 3D by Vconf -m prep SDfile
Find this compound or compounds like it in BindingDB:
Activity Spreadsheet -- Enzyme Inhibition Constant Data from BindingDB
Found 1 hit for monomerid = 50107677
TargetTubulin beta-2B chain(Bos taurus)
University Of Regensburg
Curated by ChEMBL
LigandPNGBDBM50107677((3-Hydroxy-phenyl)-(5-methoxy-1H-indol-2-yl)-metha...)
Affinity DataIC50:  660nM. Assay description: Inhibition of tubulin polymerization.
In DepthDetails ArticlePubMed