BDBM50107728 CHEMBL3600496
SMILES CCNC(=O)c1noc(c1C#Cc1ccccc1)-c1cc(C(C)C)c(O)cc1O
InChI Key InChIKey=BQLQIGOSKSOFMN-UHFFFAOYSA-N
Data  2 IC50
  Tab Delimited (TSV)   2D SDfile   Computed 3D by Vconf -m prep SDfile
Find this compound or compounds like it in BindingDB:
Activity Spreadsheet -- Enzyme Inhibition Constant Data from BindingDB
Found 2 hits for monomerid = 50107728
TargetHeat shock protein HSP 90-alpha(Homo sapiens (Human))
Chengdu University Of Tcm
Curated by ChEMBL
LigandPNGBDBM50107728(CHEMBL3600496)
Affinity DataIC50:  125nM. Assay description: Binding affinity to HSP90alpha (unknown origin) by fluorescence polarization assay
In DepthDetails ArticlePubMed
TargetHeat shock protein HSP 90-beta(Homo sapiens (Human))
Chengdu University Of Tcm
Curated by ChEMBL
LigandPNGBDBM50107728(CHEMBL3600496)
Affinity DataIC50:  144nM. Assay description: Binding affinity to HSP90beta (unknown origin) by fluorescence polarization assay
In DepthDetails ArticlePubMed