BDBM50108054 4-[(E)-2-(3,5-Dimethoxy-phenyl)-vinyl]-pyridine::4-[2-(3,5-Dimethoxy-phenyl)-vinyl]-pyridine::CHEMBL43013
SMILES COc1cc(OC)cc(\C=C\c2ccncc2)c1
InChI Key InChIKey=HXJQPOSPRKZPGS-ONEGZZNKSA-N
Data  3 IC50
  Tab Delimited (TSV)   2D SDfile   Computed 3D by Vconf -m prep SDfile
Find this compound or compounds like it in BindingDB:
Activity Spreadsheet -- Enzyme Inhibition Constant Data from BindingDB
Found 3 hits for monomerid = 50108054
TargetCytochrome P450 1A1(Homo sapiens (Human))
Seoul National University
Curated by ChEMBL
LigandPNGBDBM50108054(4-[(E)-2-(3,5-Dimethoxy-phenyl)-vinyl]-pyridine | ...)
Affinity DataIC50:  1.10E+3nM. Assay description: Inhibition of ethoxyresorufin O-deethylation (EROD) in bicistronic bacterial membranes epressing human cytochrome P450 1A1
In DepthDetails ArticlePubMed
TargetCytochrome P450 1B1(Homo sapiens (Human))
Seoul National University
Curated by ChEMBL
LigandPNGBDBM50108054(4-[(E)-2-(3,5-Dimethoxy-phenyl)-vinyl]-pyridine | ...)
Affinity DataIC50:  460nM. Assay description: Inhibition of ethoxyresorufin O-deethylation (EROD) in bicistronic bacterial membranes expressing human cytochrome P450 1B1
In DepthDetails ArticlePubMed
TargetCytochrome P450 1A2(Homo sapiens (Human))
Seoul National University
Curated by ChEMBL
LigandPNGBDBM50108054(4-[(E)-2-(3,5-Dimethoxy-phenyl)-vinyl]-pyridine | ...)
Affinity DataIC50:  290nM. Assay description: Inhibition of ethoxyresorufin O-deethylation (EROD) in bicistronic bacterial membranes expressing human cytochrome P450 1A2
In DepthDetails ArticlePubMed