BDBM50108153 CHEMBL306276::N-{1-(1,4-Dioxa-spiro[4.5]dec-8-yl)-2-[4-(4-trifluoromethoxy-phenoxy)-benzenesulfonyl]-ethyl}-N-hydroxy-formamide
SMILES ON(C=O)C(CS(=O)(=O)c1ccc(Oc2ccc(OC(F)(F)F)cc2)cc1)C1CCC2(CC1)OCCO2
InChI Key InChIKey=HUVXWBYSMDRXQZ-UHFFFAOYSA-N
Data  4 IC50
  Tab Delimited (TSV)   2D SDfile   Computed 3D by Vconf -m prep SDfile
Find this compound or compounds like it in BindingDB:
Activity Spreadsheet -- Enzyme Inhibition Constant Data from BindingDB
Found 4 hits for monomerid = 50108153
TargetMatrix metalloproteinase-9(Homo sapiens (Human))
Abbott Laboratories
Curated by ChEMBL
LigandPNGBDBM50108153(CHEMBL306276 | N-{1-(1,4-Dioxa-spiro[4.5]dec-8-yl)...)
Affinity DataIC50:  2nM. Assay description: In vitro selective inhibition against Matrix metalloprotease-9 (MMP-9) using fluorimetric assay
In DepthDetails ArticlePubMed
TargetMatrix metalloproteinase-9(Homo sapiens (Human))
Abbott Laboratories
Curated by ChEMBL
LigandPNGBDBM50108153(CHEMBL306276 | N-{1-(1,4-Dioxa-spiro[4.5]dec-8-yl)...)
Affinity DataIC50:  2nM. Assay description: Inhibition of MMP9
In DepthDetails ArticlePubMed
Target72 kDa type IV collagenase(Homo sapiens (Human))
Abbott Laboratories
Curated by ChEMBL
LigandPNGBDBM50108153(CHEMBL306276 | N-{1-(1,4-Dioxa-spiro[4.5]dec-8-yl)...)
Affinity DataIC50:  0.420nM. Assay description: In vitro selective inhibition against matrix metalloprotease-2 (MMP-2) using fluorimetric assay
In DepthDetails ArticlePubMed
TargetInterstitial collagenase(Homo sapiens (Human))
Abbott Laboratories
Curated by ChEMBL
LigandPNGBDBM50108153(CHEMBL306276 | N-{1-(1,4-Dioxa-spiro[4.5]dec-8-yl)...)
Affinity DataIC50:  5.00E+4nM. Assay description: In vitro selective inhibition against matrix metalloprotease-1 (MMP-1) using a fluorimetric assay
In DepthDetails ArticlePubMed