BDBM50108165 CHEMBL306050::N-Hydroxy-N-[2-[4-(4-trifluoromethoxy-phenoxy)-benzenesulfonyl]-1-(2,2,5-trimethyl-[1,3]dioxolan-4-yl)-ethyl]-formamide
SMILES C[C@@H]1OC(C)(C)OC1[C@@H](CS(=O)(=O)c1ccc(Oc2ccc(OC(F)(F)F)cc2)cc1)N(O)C=O
InChI Key InChIKey=FATWEDBJJYSZOL-JUPPYLHDSA-N
Data  3 IC50
  Tab Delimited (TSV)   2D SDfile   Computed 3D by Vconf -m prep SDfile
Find this compound or compounds like it in BindingDB:
Activity Spreadsheet -- Enzyme Inhibition Constant Data from BindingDB
Found 3 hits for monomerid = 50108165
TargetMatrix metalloproteinase-9(Homo sapiens (Human))
Abbott Laboratories
Curated by ChEMBL
LigandPNGBDBM50108165(CHEMBL306050 | N-Hydroxy-N-[2-[4-(4-trifluorometho...)
Affinity DataIC50:  1.10nM. Assay description: In vitro selective inhibition against Matrix metalloprotease-9 (MMP-9) using fluorimetric assay
In DepthDetails ArticlePubMed
Target72 kDa type IV collagenase(Homo sapiens (Human))
Abbott Laboratories
Curated by ChEMBL
LigandPNGBDBM50108165(CHEMBL306050 | N-Hydroxy-N-[2-[4-(4-trifluorometho...)
Affinity DataIC50:  1.90nM. Assay description: In vitro selective inhibition against matrix metalloprotease-2 (MMP-2) using fluorimetric assay
In DepthDetails ArticlePubMed
TargetInterstitial collagenase(Homo sapiens (Human))
Abbott Laboratories
Curated by ChEMBL
LigandPNGBDBM50108165(CHEMBL306050 | N-Hydroxy-N-[2-[4-(4-trifluorometho...)
Affinity DataIC50: >5.00E+4nM. Assay description: In vitro selective inhibition against matrix metalloprotease-1 (MMP-1) using a fluorimetric assay
In DepthDetails ArticlePubMed