BDBM50108171 CHEMBL77874::N-Hydroxy-N-{3-hydroxy-2-hydroxymethyl-1-[4-(4-trifluoromethoxy-phenoxy)-benzenesulfonylmethyl]-propyl}-formamide
SMILES OCC(CO)C(CS(=O)(=O)c1ccc(Oc2ccc(OC(F)(F)F)cc2)cc1)N(O)C=O
InChI Key InChIKey=WGXKBOQJZAHOOA-UHFFFAOYSA-N
Data  4 IC50
  Tab Delimited (TSV)   2D SDfile   Computed 3D by Vconf -m prep SDfile
Find this compound or compounds like it in BindingDB:
Activity Spreadsheet -- Enzyme Inhibition Constant Data from BindingDB
Found 4 hits for monomerid = 50108171
TargetMatrix metalloproteinase-9(Homo sapiens (Human))
Abbott Laboratories
Curated by ChEMBL
LigandPNGBDBM50108171(CHEMBL77874 | N-Hydroxy-N-{3-hydroxy-2-hydroxymeth...)
Affinity DataIC50:  4.90nM. Assay description: In vitro selective inhibition against Matrix metalloprotease-9 (MMP-9) using fluorimetric assay
In DepthDetails ArticlePubMed
TargetMatrix metalloproteinase-9(Homo sapiens (Human))
Abbott Laboratories
Curated by ChEMBL
LigandPNGBDBM50108171(CHEMBL77874 | N-Hydroxy-N-{3-hydroxy-2-hydroxymeth...)
Affinity DataIC50:  0.490nM. Assay description: Inhibition of MMP9
In DepthDetails ArticlePubMed
Target72 kDa type IV collagenase(Homo sapiens (Human))
Abbott Laboratories
Curated by ChEMBL
LigandPNGBDBM50108171(CHEMBL77874 | N-Hydroxy-N-{3-hydroxy-2-hydroxymeth...)
Affinity DataIC50:  2.80nM. Assay description: In vitro selective inhibition against matrix metalloprotease-2 (MMP-2) using fluorimetric assay
In DepthDetails ArticlePubMed
TargetInterstitial collagenase(Homo sapiens (Human))
Abbott Laboratories
Curated by ChEMBL
LigandPNGBDBM50108171(CHEMBL77874 | N-Hydroxy-N-{3-hydroxy-2-hydroxymeth...)
Affinity DataIC50: >5.00E+4nM. Assay description: In vitro selective inhibition against matrix metalloprotease-1 (MMP-1) using a fluorimetric assay
In DepthDetails ArticlePubMed