BDBM50108253 3-(3,4-Dichloro-phenyl)-1-(3-fluoro-5-trifluoromethyl-benzyloxy)-5-(4-hydroxy-4-phenyl-piperidin-1-yl)-pentan-2-one O-methyl-oxime::CHEMBL285476
SMILES CO\N=C(/COCc1cc(F)cc(c1)C(F)(F)F)C(CCN1CCC(O)(CC1)c1ccccc1)c1ccc(Cl)c(Cl)c1
InChI Key InChIKey=DZORGIJHDLMMAP-DMFHDPHMSA-N
Data  2 KI
  Tab Delimited (TSV)   2D SDfile   Computed 3D by Vconf -m prep SDfile
Find this compound or compounds like it in BindingDB:
Activity Spreadsheet -- Enzyme Inhibition Constant Data from BindingDB
Found 2 hits for monomerid = 50108253
TargetSubstance-K receptor(Homo sapiens (Human))
Schering-Plough Research Institute
Curated by ChEMBL
LigandPNGBDBM50108253(3-(3,4-Dichloro-phenyl)-1-(3-fluoro-5-trifluoromet...)
Affinity DataKi:  10nM. Assay description: Binding affinity test against Neurokinin 2 (NK2) receptor
In DepthDetails ArticlePubMed
TargetSubstance-P receptor(Homo sapiens (Human))
Schering-Plough Research Institute
Curated by ChEMBL
LigandPNGBDBM50108253(3-(3,4-Dichloro-phenyl)-1-(3-fluoro-5-trifluoromet...)
Affinity DataKi:  96nM. Assay description: Tested for binding affinity against neurokinin 1 (NK1) receptor
In DepthDetails ArticlePubMed