BDBM50108263 3-(3,4-Dichloro-phenyl)-1-(3,5-dimethoxy-benzyloxy)-5-(4-hydroxy-4-phenyl-piperidin-1-yl)-pentan-2-one O-methyl-oxime::CHEMBL284396
SMILES CO\N=C(/COCc1cc(OC)cc(OC)c1)C(CCN1CCC(O)(CC1)c1ccccc1)c1ccc(Cl)c(Cl)c1
InChI Key InChIKey=RSTWJTPPTSOYKZ-JSLDZMDGSA-N
Data  2 KI
  Tab Delimited (TSV)   2D SDfile   Computed 3D by Vconf -m prep SDfile
Find this compound or compounds like it in BindingDB:
Activity Spreadsheet -- Enzyme Inhibition Constant Data from BindingDB
Found 2 hits for monomerid = 50108263
TargetSubstance-K receptor(Homo sapiens (Human))
Schering-Plough Research Institute
Curated by ChEMBL
LigandPNGBDBM50108263(3-(3,4-Dichloro-phenyl)-1-(3,5-dimethoxy-benzyloxy...)
Affinity DataKi:  18nM. Assay description: Binding affinity test against Neurokinin 2 (NK2) receptor
In DepthDetails ArticlePubMed
TargetSubstance-P receptor(Homo sapiens (Human))
Schering-Plough Research Institute
Curated by ChEMBL
LigandPNGBDBM50108263(3-(3,4-Dichloro-phenyl)-1-(3,5-dimethoxy-benzyloxy...)
Affinity DataKi:  33nM. Assay description: Tested for binding affinity against neurokinin 1 (NK1) receptor
In DepthDetails ArticlePubMed