BDBM50108268 4-Dimethylamino-naphthalene-1-carboxylic acid {3-(3,4-dichloro-phenyl)-5-(4-hydroxy-4-phenyl-piperidin-1-yl)-2-[(Z)-methoxyimino]-pentyl}-methyl-amide::CHEMBL160210
SMILES CO\N=C(/CN(C)C(=O)c1ccc(N(C)C)c2ccccc12)C(CCN1CCC(O)(CC1)c1ccccc1)c1ccc(Cl)c(Cl)c1
InChI Key InChIKey=XNVWNVRFENUWFF-QZQBIAJISA-N
Data  2 KI
  Tab Delimited (TSV)   2D SDfile   Computed 3D by Vconf -m prep SDfile
Find this compound or compounds like it in BindingDB:
Activity Spreadsheet -- Enzyme Inhibition Constant Data from BindingDB
Found 2 hits for monomerid = 50108268
TargetSubstance-K receptor(Homo sapiens (Human))
Schering-Plough Research Institute
Curated by ChEMBL
LigandPNGBDBM50108268(4-Dimethylamino-naphthalene-1-carboxylic acid {3-(...)
Affinity DataKi:  7nM. Assay description: Binding affinity test against Neurokinin 2 (NK2) receptor
In DepthDetails ArticlePubMed
TargetSubstance-P receptor(Homo sapiens (Human))
Schering-Plough Research Institute
Curated by ChEMBL
LigandPNGBDBM50108268(4-Dimethylamino-naphthalene-1-carboxylic acid {3-(...)
Affinity DataKi:  12nM. Assay description: Tested for binding affinity against neurokinin 1 (NK1) receptor
In DepthDetails ArticlePubMed