BDBM50108308 (2-Indol-1-yl-ethyl)-dimethyl-amine::(2-Indol-1-ylethyl)dimethylamine::CHEMBL38633
SMILES CN(C)CCn1ccc2ccccc12
InChI Key InChIKey=PSHKCPACSIZILK-UHFFFAOYSA-N
Data  4 KI
  Tab Delimited (TSV)   2D SDfile   Computed 3D by Vconf -m prep SDfile
Find this compound or compounds like it in BindingDB:
Activity Spreadsheet -- Enzyme Inhibition Constant Data from BindingDB
Found 4 hits for monomerid = 50108308
Target5-hydroxytryptamine receptor 2A(Homo sapiens (Human))
Virginia Commonwealth University
Curated by ChEMBL
LigandPNGBDBM50108308((2-Indol-1-yl-ethyl)-dimethyl-amine | (2-Indol-1-y...)
Affinity DataKi:  600nM. Assay description: Tested for binding affinity of the compound towards human 5-hydroxytryptamine 2A receptor using [3H]-5-HT as radioligand
In DepthDetails ArticlePubMed
Target5-hydroxytryptamine receptor 2A(Homo sapiens (Human))
Virginia Commonwealth University
Curated by ChEMBL
LigandPNGBDBM50108308((2-Indol-1-yl-ethyl)-dimethyl-amine | (2-Indol-1-y...)
Affinity DataKi:  650nM. Assay description: Displacement of [3H]-DOB from human 5-hydroxytryptamine 2A receptor
In DepthDetails ArticlePubMed
Target5-hydroxytryptamine receptor 2C(Homo sapiens (Human))
Virginia Commonwealth University
Curated by ChEMBL
LigandPNGBDBM50108308((2-Indol-1-yl-ethyl)-dimethyl-amine | (2-Indol-1-y...)
Affinity DataKi:  720nM. Assay description: Binding affinity towards human 5-hydroxytryptamine 2C receptor.
In DepthDetails ArticlePubMed
Target5-hydroxytryptamine receptor 6(Homo sapiens (Human))
Virginia Commonwealth University
Curated by ChEMBL
LigandPNGBDBM50108308((2-Indol-1-yl-ethyl)-dimethyl-amine | (2-Indol-1-y...)
Affinity DataKi: >5.00E+3nM. Assay description: Binding affinity against 5-hydroxytryptamine 6 receptor
In DepthDetails ArticlePubMed