BDBM50108478 3-[3'-(3-Isobutyl-ureido)-4-methoxy-biphenyl-3-sulfonylamino]-3-phenyl-propionic acid::CHEMBL432139
SMILES COc1ccc(cc1S(=O)(=O)NC(CC(O)=O)c1ccccc1)-c1cccc(NC(=O)NCC(C)C)c1
InChI Key InChIKey=GXJLKDJMXLRNOL-UHFFFAOYSA-N
Data  1 KI
  Tab Delimited (TSV)   2D SDfile   Computed 3D by Vconf -m prep SDfile
Find this compound or compounds like it in BindingDB:
Activity Spreadsheet -- Enzyme Inhibition Constant Data from BindingDB
Found 1 hit for monomerid = 50108478
TargetIntegrin alpha-V/beta-3(Homo sapiens (Human))
Bayer
Curated by ChEMBL
LigandPNGBDBM50108478(3-[3'-(3-Isobutyl-ureido)-4-methoxy-biphenyl-3-sul...)
Affinity DataKi:  90nM. Assay description: In vitro activity in an vitronectin receptor (alpha v beta3) scintillation bead assay using 125-I labelled echistatin as a radioligand
In DepthDetails ArticlePubMed