BDBM50109022 CHEMBL3601785
SMILES Cn1cnc(C[C@H](NC(=O)c2cnccn2)C(=O)N2CCC[C@H]2C(N)=O)c1Br
InChI Key InChIKey=JZEDEIDXZNCULP-AAEUAGOBSA-N
Data  2 IC50  2 EC50
  Tab Delimited (TSV)   2D SDfile   Computed 3D by Vconf -m prep SDfile
Find this compound or compounds like it in BindingDB:
Activity Spreadsheet -- Enzyme Inhibition Constant Data from BindingDB
Found 4 hits for monomerid = 50109022
TargetThyrotropin-releasing hormone receptor(Mus musculus)
National Institute Of Pharmaceutical Education And Research
Curated by ChEMBL
LigandPNGBDBM50109022(CHEMBL3601785)
Affinity DataIC50: >5.00E+4nM. Assay description: Displacement of [3H]-1-MeHis-TRH from mouse TRH-R2 expressed in HEK293 cells incubated up to 4 hrs by scintillation counting method
In DepthDetails ArticlePubMed
TargetThyrotropin-releasing hormone receptor(Mus musculus)
National Institute Of Pharmaceutical Education And Research
Curated by ChEMBL
LigandPNGBDBM50109022(CHEMBL3601785)
Affinity DataEC50:  30nM. Assay description: Agonist activity at mouse TRH-R2 expressed in HEK293 cells assessed as induction of changes in intracellular Ca2+ level by FLIPR method
In DepthDetails ArticlePubMed
TargetThyrotropin-releasing hormone receptor(MOUSE)
National Institute Of Pharmaceutical Education And Research
Curated by ChEMBL
LigandPNGBDBM50109022(CHEMBL3601785)
Affinity DataEC50:  340nM. Assay description: Agonist activity at mouse TRH-R1 expressed in HEK293 cells assessed as induction of changes in intracellular Ca2+ level by FLIPR method
In DepthDetails ArticlePubMed
TargetThyrotropin-releasing hormone receptor(MOUSE)
National Institute Of Pharmaceutical Education And Research
Curated by ChEMBL
LigandPNGBDBM50109022(CHEMBL3601785)
Affinity DataIC50: >5.00E+4nM. Assay description: Displacement of [3H]-1-MeHis-TRH from mouse TRH-R1 expressed in HEK293 cells incubated up to 4 hrs by scintillation counting method
In DepthDetails ArticlePubMed