BDBM50109191 5-Cyano-4-[3-(3-{3-[4-(2-methoxy-phenyl)-piperazin-1-yl]-propyl}-ureido)-phenyl]-2,6-dimethyl-1,4-dihydro-pyridine-3-carboxylic acid methyl ester::CHEMBL124953
SMILES COC(=O)C1=C(C)N=C(C)C(C#N)C1c1cccc(NC(=O)NCCCN2CCN(CC2)c2ccccc2OC)c1
InChI Key InChIKey=PKNPKVYUZQVMMY-UHFFFAOYSA-N
Data  1 KI
  Tab Delimited (TSV)   2D SDfile   Computed 3D by Vconf -m prep SDfile
Find this compound or compounds like it in BindingDB:
Activity Spreadsheet -- Enzyme Inhibition Constant Data from BindingDB
Found 1 hit for monomerid = 50109191
TargetNeuropeptide Y receptor type 1(Homo sapiens (Human))
Pharmaceutical Research Institute
Curated by ChEMBL
LigandPNGBDBM50109191(5-Cyano-4-[3-(3-{3-[4-(2-methoxy-phenyl)-piperazin...)
Affinity DataKi:  684nM. Assay description: Inhibition of binding of [125I]-PYY radioligand to human neuropeptide Y1 receptor in SK-N-MC cell membrane
In DepthDetails ArticlePubMed