BDBM50109265 CHEMBL3601102
SMILES CC(C)CCN1C(=O)S\C(=C/c2ccc(cc2)C(=O)N[C@@H](CCCNC(N)=N)C(=O)N[C@@H](CCCCN)C(=O)N[C@H](C(N)=O)c2ccccc2)C1=O
InChI Key InChIKey=SJWFLLALPAEONU-IZSHNOSSSA-N
Data  1 IC50
  Tab Delimited (TSV)   2D SDfile   Computed 3D by Vconf -m prep SDfile
Find this compound or compounds like it in BindingDB:
Activity Spreadsheet -- Enzyme Inhibition Constant Data from BindingDB
Found 1 hit for monomerid = 50109265
TargetGenome polyprotein(West Nile virus)
Heidelberg University
Curated by ChEMBL
LigandPNGBDBM50109265(CHEMBL3601102)
Affinity DataIC50:  1.76E+3nM. Assay description: Inhibition of WNV NS2B-NS3 protease expressed in Escherichia coli BL21 lambda (DE3) cells using Abz-Gly-Leu-Lys-Arg-Gly-Gly-3-(NO2)Tyr as substrate p...
In DepthDetails ArticlePubMed