BDBM50109536 CHEMBL3604128
SMILES CN(CC#C)c1nc2nc(CCC3CCN(Cc4ccccc4)CC3)ccc2c(-c2ccccc2)c1C#N
InChI Key InChIKey=RCIYNUSLUDQJLO-UHFFFAOYSA-N
Data  1 KI
  Tab Delimited (TSV)   2D SDfile   Computed 3D by Vconf -m prep SDfile
Find this compound or compounds like it in BindingDB:
Activity Spreadsheet -- Enzyme Inhibition Constant Data from BindingDB
Found 1 hit for monomerid = 50109536
TargetAmine oxidase [flavin-containing] B(Homo sapiens (Human))
Sapienza University Of Rome
Curated by ChEMBL
LigandPNGBDBM50109536(CHEMBL3604128)
Affinity DataKi:  32nM. Assay description: Inhibition of human MAOB
In DepthDetails ArticlePubMed