BDBM50109737 CHEMBL3604170
SMILES O=C(Nc1ccccc1)c1cn[nH]n1
InChI Key InChIKey=LDZMXBCCRCCBOI-UHFFFAOYSA-N
Data  1 IC50
  Tab Delimited (TSV)   2D SDfile   Computed 3D by Vconf -m prep SDfile
Find this compound or compounds like it in BindingDB:
Activity Spreadsheet -- Enzyme Inhibition Constant Data from BindingDB
Found 1 hit for monomerid = 50109737
TargetPolyunsaturated fatty acid lipoxygenase ALOX15(Homo sapiens (Human))
Uppsala University
Curated by ChEMBL
LigandPNGBDBM50109737(CHEMBL3604170)
Affinity DataIC50:  97nM. Assay description: Inhibition of 15-LOX-1 in human L1236 cells assessed as reduction in conversion of arachidonic acid to 15-HETE pre-incubated 5 min before arachidonic...
In DepthDetails ArticlePubMed