BDBM50110051 1-{2-[4-Methoxy-3-(5-phenyl-pentyloxy)-phenyl]-propyl}-1,3-dihydro-imidazol-2-ylidene-cyanamide::CHEMBL160603
SMILES COc1ccc(cc1OCCCCCc1ccccc1)C(C)Cn1ccnc1NC#N
InChI Key InChIKey=MMMMGXJULDFOQE-UHFFFAOYSA-N
Data  1 IC50
  Tab Delimited (TSV)   2D SDfile   Computed 3D by Vconf -m prep SDfile
Find this compound or compounds like it in BindingDB:
Activity Spreadsheet -- Enzyme Inhibition Constant Data from BindingDB
Found 1 hit for monomerid = 50110051
TargetcAMP-specific 3',5'-cyclic phosphodiesterase 4B(Homo sapiens (Human))
Janssen-Cilag
Curated by ChEMBL
LigandPNGBDBM50110051(1-{2-[4-Methoxy-3-(5-phenyl-pentyloxy)-phenyl]-pro...)
Affinity DataIC50:  36nM. Assay description: Inhibitory activity against recombinant phosphodiesterase 4B (PDE4B) of human mononuclear lymphocytes
In DepthDetails ArticlePubMed