BDBM50110229 3-({[2-(5-(4-methyl-pyridin-2-ylamino)-pentanoyl)hydrazino]carbonyl}amino)-3-(3,5-dichlorophenyl)propanoic acid::CHEMBL268056
SMILES Cc1ccnc(NCCCCC(=O)NNC(=O)NC(CC(O)=O)c2cc(Cl)cc(Cl)c2)c1
InChI Key InChIKey=VNWMBEFZMNRHEI-UHFFFAOYSA-N
Data  7 IC50
  Tab Delimited (TSV)   2D SDfile   Computed 3D by Vconf -m prep SDfile
Find this compound or compounds like it in BindingDB:
Activity Spreadsheet -- Enzyme Inhibition Constant Data from BindingDB
Found 7 hits for monomerid = 50110229
TargetIntegrin alpha-V/beta-3(Homo sapiens (Human))
Merck
Curated by ChEMBL
LigandPNGBDBM50110229(3-({[2-(5-(4-methyl-pyridin-2-ylamino)-pentanoyl)h...)
Affinity DataIC50:  1.20E+4nM. Assay description: Inhibition of integrin alpha-v/beta-3 mediated M21 cell adhesion to vitronectin with monoclonal antibody P1F6
In DepthDetails ArticlePubMed
TargetIntegrin alpha-IIb/beta-3(Homo sapiens (Human))
Merck
Curated by ChEMBL
LigandPNGBDBM50110229(3-({[2-(5-(4-methyl-pyridin-2-ylamino)-pentanoyl)h...)
Affinity DataIC50: >1.00E+4nM. Assay description: Inhibition of fibrinogen binding to recombinant human platelet glycoprotein alpha IIb beta3 integrin
In DepthDetails ArticlePubMed
TargetIntegrin alpha-V/beta-6(Homo sapiens (Human))
Merck
Curated by ChEMBL
LigandPNGBDBM50110229(3-({[2-(5-(4-methyl-pyridin-2-ylamino)-pentanoyl)h...)
Affinity DataIC50:  1.70nM. Assay description: Inhibition of fibronectin binding to recombinant human alphaV-beta6 integrin
In DepthDetails ArticlePubMed
TargetIntegrin alpha-V/beta-6(Homo sapiens (Human))
Merck
Curated by ChEMBL
LigandPNGBDBM50110229(3-({[2-(5-(4-methyl-pyridin-2-ylamino)-pentanoyl)h...)
Affinity DataIC50:  300nM. Assay description: Inhibition of integrin alpha-v/beta-6 mediated UCLAP-3 cell adhesion to fibronectin
In DepthDetails ArticlePubMed
TargetIntegrin alpha-V/beta-5(Homo sapiens (Human))
Merck
Curated by ChEMBL
LigandPNGBDBM50110229(3-({[2-(5-(4-methyl-pyridin-2-ylamino)-pentanoyl)h...)
Affinity DataIC50:  5.00E+3nM. Assay description: Inhibition of integrin alpha-v/beta-5 mediated UCLAP-3 cell adhesion on vitronectin
In DepthDetails ArticlePubMed
TargetIntegrin alpha-V/beta-3(Homo sapiens (Human))
Merck
Curated by ChEMBL
LigandPNGBDBM50110229(3-({[2-(5-(4-methyl-pyridin-2-ylamino)-pentanoyl)h...)
Affinity DataIC50:  64nM. Assay description: Inhibition of vitronectin binding to recombinant human alphaV-beta3 integrin
In DepthDetails ArticlePubMed
TargetIntegrin alpha-V/beta-5(Homo sapiens (Human))
Merck
Curated by ChEMBL
LigandPNGBDBM50110229(3-({[2-(5-(4-methyl-pyridin-2-ylamino)-pentanoyl)h...)
Affinity DataIC50:  2.50E+3nM. Assay description: Inhibition of vitronectin binding to recombinant human alphaV-beta5 integrin
In DepthDetails ArticlePubMed