BDBM50110534 1-Cyclohexyl-4-{1-[4-(4-methoxy-benzenesulfonyl)-phenyl]-ethyl}-2-methyl-piperazine::CHEMBL350956
SMILES COc1ccc(cc1)S(=O)(=O)c1ccc(cc1)[C@@H](C)N1CCN([C@@H](C)C1)C1CCCCC1
InChI Key InChIKey=RSOCHPRSLOSOOO-LEWJYISDSA-N
Data  1 KI
  Tab Delimited (TSV)   2D SDfile   Computed 3D by Vconf -m prep SDfile
Find this compound or compounds like it in BindingDB:
Activity Spreadsheet -- Enzyme Inhibition Constant Data from BindingDB
Found 1 hit for monomerid = 50110534
TargetMuscarinic acetylcholine receptor M2(Homo sapiens (Human))
Schering-Plough Research Institute
Curated by ChEMBL
LigandPNGBDBM50110534(1-Cyclohexyl-4-{1-[4-(4-methoxy-benzenesulfonyl)-p...)
Affinity DataKi:  0.0400nM. Assay description: Binding affinity against human cloned Muscarinic acetylcholine receptor M2.
In DepthDetails ArticlePubMed