BDBM50110623 1-(2-Aza-bicyclo[2.2.2]oct-2-yl)-2-[3-{(S)-2-[2-(1H-benzoimidazol-5-yl)-ethylamino]-1-methyl-ethyl}-2-(3,5-dimethyl-phenyl)-1H-indol-5-yl]-2-methyl-propan-1-one::CHEMBL168538
SMILES C[C@H](CNCCc1ccc2nc[nH]c2c1)c1c([nH]c2ccc(cc12)C(C)(C)C(=O)N1CC2CCC1CC2)-c1cc(C)cc(C)c1
InChI Key InChIKey=ZURGVSINFPSAAI-WPCLDFDBSA-N
Data  3 IC50
  Tab Delimited (TSV)   2D SDfile   Computed 3D by Vconf -m prep SDfile
Find this compound or compounds like it in BindingDB:
Activity Spreadsheet -- Enzyme Inhibition Constant Data from BindingDB
Found 3 hits for monomerid = 50110623
TargetGonadotropin-releasing hormone receptor(Homo sapiens (Human))
Merck Research Laboratories
Curated by ChEMBL
LigandPNGBDBM50110623(1-(2-Aza-bicyclo[2.2.2]oct-2-yl)-2-[3-{(S)-2-[2-(1...)
Affinity DataIC50:  4.5nM. Assay description: Inhibition of gonadotropin-releasing hormone receptor-stimulated [3H]-inositol phosphate hydrolysis
In DepthDetails ArticlePubMed
TargetCytochrome P450 3A4(Homo sapiens (Human))
Merck Research Laboratories
Curated by ChEMBL
LigandPNGBDBM50110623(1-(2-Aza-bicyclo[2.2.2]oct-2-yl)-2-[3-{(S)-2-[2-(1...)
Affinity DataIC50:  100nM. Assay description: Inhibition of cytochrome P450 3A4 enzyme
In DepthDetails ArticlePubMed
TargetGonadotropin-releasing hormone receptor(Homo sapiens (Human))
Merck Research Laboratories
Curated by ChEMBL
LigandPNGBDBM50110623(1-(2-Aza-bicyclo[2.2.2]oct-2-yl)-2-[3-{(S)-2-[2-(1...)
Affinity DataIC50:  0.300nM. Assay description: Inhibition of [125I]-buserelin binding to human pituitary gonadotropin-releasing hormone receptor
In DepthDetails ArticlePubMed