BDBM50110859 CHEMBL26200::{4-[3-(4-Decyloxy-phenoxy)-2-oxo-propoxy]-phenyl}-acetic acid
SMILES CCCCCCCCCCOc1ccc(OCC(=O)COc2ccc(CC(O)=O)cc2)cc1
InChI Key InChIKey=FNWPQGVCVUJKCE-UHFFFAOYSA-N
Data  2 IC50
  Tab Delimited (TSV)   2D SDfile   Computed 3D by Vconf -m prep SDfile
Find this compound or compounds like it in BindingDB:
Activity Spreadsheet -- Enzyme Inhibition Constant Data from BindingDB
Found 2 hits for monomerid = 50110859
TargetCytosolic phospholipase A2 beta(Homo sapiens (Human))
Astrazeneca R&D Charnwood
Curated by ChEMBL
LigandPNGBDBM50110859(CHEMBL26200 | {4-[3-(4-Decyloxy-phenoxy)-2-oxo-pro...)
Affinity DataIC50:  17nM. Assay description: Inhibitory activity against cytosolic Phospholipase A2 (PLA2) by soluble assay
In DepthDetails ArticlePubMed
TargetCytosolic phospholipase A2 beta(Homo sapiens (Human))
Astrazeneca R&D Charnwood
Curated by ChEMBL
LigandPNGBDBM50110859(CHEMBL26200 | {4-[3-(4-Decyloxy-phenoxy)-2-oxo-pro...)
Affinity DataIC50:  150nM. Assay description: Inhibitory activity against cytosolic Phospholipase A2 (PLA2) by soluble assay
In DepthDetails ArticlePubMed