BDBM50110903 CHEMBL3604603
SMILES CCC[C@H](NC(=O)[C@@H](O)[C@H](Cc1cccs1)NC(=O)[C@H](Cc1cccs1)NC(=O)[C@@H](NC(=O)[C@@H](N)CCC(O)=O)[C@@H](C)CC)C(O)=O
InChI Key InChIKey=RNIFVMRORLIQKP-ZWKKXHERSA-N
Data  1 IC50
  Tab Delimited (TSV)   2D SDfile   Computed 3D by Vconf -m prep SDfile
Find this compound or compounds like it in BindingDB:
Activity Spreadsheet -- Enzyme Inhibition Constant Data from BindingDB
Found 1 hit for monomerid = 50110903
TargetBeta-secretase 1(Homo sapiens (Human))
Kyoto Pharmaceutical University
Curated by ChEMBL
LigandPNGBDBM50110903(CHEMBL3604603)
Affinity DataIC50:  8.70E+5nM. Assay description: Inhibition of recombinant BACE1 (unknown origin) incubated for 80 mins using [H-Ile-Lys-Thr-Glu-Glu-Ile-Ser-Glu-Val-Asn-Leu-Asp-Ala-Glu-Phe-Arg-His-A...
In DepthDetails ArticlePubMed