BDBM50110947 1-(4-Amino-phenyl)-5-(4-chloro-phenyl)-4-methyl-1H-pyrazole-3-carboxylic acid piperidin-1-ylamide::CHEMBL285964
SMILES Cc1c(nn(c1-c1ccc(Cl)cc1)-c1ccc(N)cc1)C(=O)NN1CCCCC1
InChI Key InChIKey=DVMPIQPGHYXDTF-UHFFFAOYSA-N
Data  1 KI
  Tab Delimited (TSV)   2D SDfile   Computed 3D by Vconf -m prep SDfile
Find this compound or compounds like it in BindingDB:
Activity Spreadsheet -- Enzyme Inhibition Constant Data from BindingDB
Found 1 hit for monomerid = 50110947
TargetCannabinoid receptor 1(Rattus norvegicus (rat))
University Of South Carolina
Curated by ChEMBL
LigandPNGBDBM50110947(1-(4-Amino-phenyl)-5-(4-chloro-phenyl)-4-methyl-1H...)
Affinity DataKi:  72nM. Assay description: Inhibition of [3H]-CP-55,940 binding to cannabinoid receptor 1 in rat brain membranes.
In DepthDetails ArticlePubMed