BDBM50110951 7-Chloro-1-(2,4-dichloro-phenyl)-1H-indazole-3-carboxylic acid piperidin-1-ylamide::CHEMBL36579
SMILES Clc1ccc(c(Cl)c1)-n1nc(C(=O)NN2CCCCC2)c2cccc(Cl)c12
InChI Key InChIKey=WJKXNBHLYDMZKG-UHFFFAOYSA-N
Data  1 KI
  Tab Delimited (TSV)   2D SDfile   Computed 3D by Vconf -m prep SDfile
Find this compound or compounds like it in BindingDB:
Activity Spreadsheet -- Enzyme Inhibition Constant Data from BindingDB
Found 1 hit for monomerid = 50110951
TargetCannabinoid receptor 1(Rattus norvegicus (rat))
University Of South Carolina
Curated by ChEMBL
LigandPNGBDBM50110951(7-Chloro-1-(2,4-dichloro-phenyl)-1H-indazole-3-car...)
Affinity DataKi:  746nM. Assay description: Inhibition of [3H]-CP-55,940 binding to cannabinoid receptor 1 in rat brain membranes.
In DepthDetails ArticlePubMed