BDBM50111053 Azapeptide::CHEMBL6360
SMILES CCCN(NC(=O)[C@H]1CCCN1C(=O)[C@@H](NC(=O)[C@@H](NC(=O)[C@H](CC(O)=O)NC(C)=O)C(C)C)C(C)C)C(=O)Oc1ccc(cc1)[N+]([O-])=O
InChI Key InChIKey=VNEWHRUAJXGKHM-AYEHBTSNSA-N
Data  1 KI
  Tab Delimited (TSV)   2D SDfile   Computed 3D by Vconf -m prep SDfile
Find this compound or compounds like it in BindingDB:
Activity Spreadsheet -- Enzyme Inhibition Constant Data from BindingDB
Found 1 hit for monomerid = 50111053
TargetGenome polyprotein(Hepatitis C virus)
Schering-Plough Research Institute
Curated by ChEMBL
LigandPNGBDBM50111053(Azapeptide | CHEMBL6360)
Affinity DataKi:  7.00E+3nM. Assay description: Binding affinity against Hepatitis C virus NS3 protease
In DepthDetails ArticlePubMed