BDBM50111098 2N-(4-Benzamidinemethyl)-1-[2-Phenylamino-3,3-diphenyl-(2R)-propanoyl]-(2S)-tetrahydro-1H-2-pyrrolecarboxamide;TFA
SMILES NC(=N)c1ccc(CNC(=O)[C@@H]2CCCN2C(=O)[C@H](Nc2ccccc2)C(c2ccccc2)c2ccccc2)cc1
InChI Key InChIKey=UPHVVVJACVXYJA-IGYGKHONSA-N
Data  2 KI
  Tab Delimited (TSV)   2D SDfile   Computed 3D by Vconf -m prep SDfile
Find this compound or compounds like it in BindingDB:
Activity Spreadsheet -- Enzyme Inhibition Constant Data from BindingDB
Found 2 hits for monomerid = 50111098
TargetProthrombin(Homo sapiens (Human))
Life Science R & D, Lgci
Curated by ChEMBL
LigandPNGBDBM50111098(2N-(4-Benzamidinemethyl)-1-[2-Phenylamino-3,3-diph...)
Affinity DataKi:  0.0450nM. Assay description: Binding affinity against human thrombin
In DepthDetails ArticlePubMed
TargetSerine protease 1(Bos taurus (bovine))
Life Science R & D, Lgci
Curated by ChEMBL
LigandPNGBDBM50111098(2N-(4-Benzamidinemethyl)-1-[2-Phenylamino-3,3-diph...)
Affinity DataKi:  1.5nM. Assay description: Binding affinity against bovine trypsin
In DepthDetails ArticlePubMed